注册 登录
  • 欢迎访问开心洋葱网站,在线教程,推荐使用最新版火狐浏览器和Chrome浏览器访问本网站,欢迎加入开心洋葱 QQ群
  • 为方便开心用户,开心洋葱官网已经开启复制功能!
  • 欢迎访问开心洋葱网站,手机也能访问哦~欢迎加入开心洋葱多维思维学习平台 QQ群
  • 如果您觉得本站非常有看点,那么赶紧使用Ctrl+D 收藏开心洋葱吧~~~~~~~~~~~~~!
  • 由于近期流量激增,小站的ECS没能经的起亲们的访问,本站依然没有盈利,如果各位看如果觉着文字不错,还请看官给小站打个赏~~~~~~~~~~~~~!

【已解决】Error:Execution failed for task ‘:libcocos2dx:processDebugAndroidTestResources’.之Failed to execute aapt

JAVA相关 开心洋葱 7341次浏览 已收录 47个评论 手机上查看

使用cocos2dx 编译android游戏客户端时,使用android studio 3.0以上就会出现如下错误

Error:java.util.concurrent.ExecutionException: com.android.tools.aapt2.Aapt2Exception: AAPT2 error: check logs for details

Information:Gradle tasks [:libcocos2dx:generateDebugSources, :libcocos2dx:generateDebugAndroidTestSources, :libcocos2dx:mockableAndroidJar, :hello_world:generateDebugSources, :hello_world:generateDebugAndroidTestSources, :hello_world:mockableAndroidJar]
Error:failed to create directory 'D:\CocosCreator\resources\cocos2d-x\cocos\platform\android\libcocos2dx\build\generated\source\r\androidTest\debug\org\cocos2dx\lib\test'.
Error:java.util.concurrent.ExecutionException: java.util.concurrent.ExecutionException: com.android.tools.aapt2.Aapt2Exception: AAPT2 error: check logs for details
Error:java.util.concurrent.ExecutionException: com.android.tools.aapt2.Aapt2Exception: AAPT2 error: check logs for details
Error:com.android.tools.aapt2.Aapt2Exception: AAPT2 error: check logs for details
Error:Execution failed for task ':libcocos2dx:processDebugAndroidTestResources'.
> Failed to execute aapt
Information:BUILD FAILED in 2s
Information:5 errors
Information:0 warnings
Information:See complete output in console

解决办法:

注意:本段内容须成功“回复本文”后“刷新本页”方可查看!


开心洋葱 , 版权所有丨如未注明 , 均为原创丨未经授权请勿修改 , 转载请注明【已解决】Error:Execution failed for task ‘:libcocos2dx:processDebugAndroidTestResources’.之Failed to execute aapt
喜欢 (0)
[开心洋葱]
分享 (0)
关于作者:
开心洋葱,开心洋葱头,水墨

您必须 登录 才能发表评论!

(47)个小伙伴在吐槽
  1. 非常想看看是什么解决方案
    jellyuncle2019-09-11 11:55 Windows 7 | Chrome 75.0.3770.100
  2. 看看看看看看那
    yunfei2019-04-16 11:02 Windows 7 | Chrome 73.0.3683.86
  3. aaa
    azq1186802019-03-29 15:26 Windows 7 | Chrome 65.0.3325.181
  4. trewtrewterwtrew
    lnslc2019-03-20 10:41 Windows 7 | Chrome 72.0.3626.81
  5. How to solve
    shennandong2019-03-20 10:03 Windows 7 | Chrome 72.0.3626.121
  6. 如何解决!
    tudouaini2019-02-25 12:32 Windows 7 | Chrome 68.0.3440.106
  7. 怎么解决的
    Jeremy2019-02-18 14:51 Windows 10 | Firefox 65.0
  8. 怎么处理的呀?
    mph14462019-02-11 13:40 Windows 7 | Chrome 63.0.3239.26
  9. 解决方案是什么
    zeng2019-01-30 14:54 Windows 7 | Chrome 70.0.3538.110
  10. 句读2019-01-22 19:50 Windows 10 | Maxthon 5.2.5.4000
  11. ?????????????????????????????
    xiaofl312019-01-17 11:20 Windows 7 | Chrome 71.0.3578.98
  12. 2
    zxplove42019-01-04 11:36 Windows 10 | Chrome 71.0.3578.98
  13. 输的功夫
    陨星莫2018-12-12 14:37 Windows 7 | Chrome 70.0.3538.110
  14. 解决方案是什么
    whereisnothing2018-12-07 16:40 Windows 7 | Chrome 68.0.3440.84
  15. ssssssss
    a37383122018-11-20 19:36 Windows 10 | Chrome 70.0.3538.102
  16. 看看解决办法是什么
    tianxiadiyi2018-11-16 12:52 Windows 7 | Chrome 55.0.2883.87
12
……